C:\Users\14359\Desktop\collect2.exe [Error] ld returned 1 exit status
时间: 2024-06-21 09:01:42 浏览: 106
"C:\Users\14359\Desktop\collect2.exe" 是一个可执行文件,通常在Linux或某些Unix-like系统中,collect2.exe 是GCC编译器链(compiler chain)的一部分,用于链接阶段(linking)。当你看到 "Error: ld returned 1 exit status" 错误,这意味着在尝试编译或链接程序时,链接器(ld)遇到了错误,导致返回了非零退出状态。
这可能是由于多种原因引起的,比如:
1. 缺少依赖库:collect2可能找不到所需的动态链接库。
2. 链接错误:可能是某个函数未定义、导入错误,或者是符号解析失败。
3. 代码问题:源文件中的语法错误、类型不匹配等。
4. 环境变量设置不正确:如路径设置或工具链配置问题。
要解决这个问题,你可以尝试以下步骤:
1. 检查编译选项和依赖项是否完整。
2. 查看编译日志,找出具体错误信息。
3. 确认路径设置正确,包括库文件路径。
4. 更新或重新安装GCC编译器。
5. 使用`ldd`命令检查程序的动态链接库。
如果需要进一步的帮助,请提供具体的错误信息和上下文,以便更好地定位问题。
相关问题
[Running] cd "c:\Users\86188\Desktop\vsCode\" && gcc aaaa -o c:\Users\86188\Desktop\vsCode\aaaa && "c:\Users\86188\Desktop\vsCode\"c:\Users\86188\Desktop\vsCode\aaaa aaaa: file not recognized: File truncated collect2.exe: error: ld returned 1 exit status [Done] exited with code=1 in 0.067 seconds [Running] cd "c:\Users\86188\Desktop\vsCode\" && gcc aaaa -o c:\Users\86188\Desktop\vsCode\aaaa && "c:\Users\86188\Desktop\vsCode\"c:\Users\86188\Desktop\vsCode\aaaa aaaa: file not recognized: File truncated collect2.exe: error: ld returned 1 exit status [Done] exited with code=1 in 0.067 seconds [Running] cd "c:\Users\86188\Desktop\vsCode\" && gcc aaaa -o c:\Users\86188\Desktop\vsCode\aaaa && "c:\Users\86188\Desktop\vsCode\"c:\Users\86188\Desktop\vsCode\aaaa aaaa: file not recognized: File truncated collect2.exe: error: ld returned 1 exit status
这个错误提示表明你的程序文件 "aaaa" 没有被正确识别,并且编译过程中出现了截断文件的错误。导致链接器 "ld" 返回了 1 的退出状态码。
这个问题可能有几个原因导致:
1. 确保你的程序文件 "aaaa" 存在于指定的路径 "c:\Users\86188\Desktop\vsCode\"。
2. 检查你的程序文件是否有损坏或不完整。尝试重新下载或复制一份正确的文件。
3. 确保你的编译命令正确无误。在你的命令中,你需要使用 `-c` 选项来编译源文件,并使用 `-o` 选项来指定输出文件名。例如:`gcc aaaa.c -o aaaa.exe`。
请检查以上可能导致问题的因素,并尝试修复它们。如果问题仍然存在,请提供更多的信息,以便我可以更好地帮助你解决。
C:\Users\13993\Desktop\c语言\c语言作业\collect2.exe [Error] ld returned 1 exit status
这个错误是由于链接器(ld)返回了1的退出状态,通常表示链接过程中出现了错误。collect2.exe是一个GNU链接器的前端程序,它用于调用实际的链接器进行链接操作。
可能的原因包括:
1. 缺少必要的库文件或链接器无法找到所需的库文件。
2. 代码中存在语法错误或逻辑错误,导致链接失败。
3. 编译器选项设置不正确,导致链接失败。
为了解决这个问题,你可以尝试以下几个步骤:
1. 检查代码中是否存在语法错误或逻辑错误,并进行修正。
2. 确保所有需要的库文件都已正确地包含在项目中,并且链接器可以找到它们。
3. 检查编译器选项是否正确设置,例如指定正确的库路径、链接选项等。
如果你能提供更多的信息,比如你的代码或者具体的错误提示,我可以给出更具体的建议。
阅读全文