make: Leaving directory '/home/wanglangtao/frifly/rk3399_linux_release_v2.5.1_20210301/buildroot' 2023-06-07T03:54:43 >>> host-gcc-initial 8.4.0 Building 2023-06-07T03:54:47 >>> host-gcc-initial 8.4.0 Installing to host directory 2023-06-07T03:54:49 >>> host-libtool 2.4.6 Extracting 2023-06-07T03:54:50 >>> host-libtool 2.4.6 Patching 2023-06-07T03:54:50 >>> host-libtool 2.4.6 Updating config.sub and config.guess 2023-06-07T03:54:50 >>> host-libtool 2.4.6 Configuring 2023-06-07T03:54:53 >>> host-libtool 2.4.6 Building 2023-06-07T03:54:54 >>> host-libtool 2.4.6 Installing to host directory 2023-06-07T03:54:55 >>> host-autoconf 2.69 Extracting 2023-06-07T03:54:55 >>> host-autoconf 2.69 Patching 2023-06-07T03:54:55 >>> host-autoconf 2.69 Updating config.sub and config.guess 2023-06-07T03:54:55 >>> host-autoconf 2.69 Patching libtool 2023-06-07T03:54:55 >>> host-autoconf 2.69 Configuring 2023-06-07T03:54:56 >>> host-autoconf 2.69 Building 2023-06-07T03:54:57 >>> host-autoconf 2.69 Installing to host directory 2023-06-07T03:54:57 >>> host-automake 1.15.1 Extracting 2023-06-07T03:54:57 >>> host-automake 1.15.1 Patching 2023-06-07T03:54:57 >>> host-automake 1.15.1 Updating config.sub and config.guess 2023-06-07T03:54:57 >>> host-automake 1.15.1 Patching libtool 2023-06-07T03:54:58 >>> host-automake 1.15.1 Configuring 2023-06-07T03:54:59 >>> host-automake 1.15.1 Building 2023-06-07T03:54:59 >>> host-automake 1.15.1 Installing to host directory 2023-06-07T03:55:00 >>> host-pkgconf 0.9.12 Extracting 2023-06-07T03:55:00 >>> host-pkgconf 0.9.12 Patching 2023-06-07T03:55:00 >>> host-pkgconf 0.9.12 Updating config.sub and config.guess 2023-06-07T03:55:00 >>> host-pkgconf 0.9.12 Patching libtool 2023-06-07T03:55:00 >>> host-pkgconf 0.9.12 Configuring 2023-06-07T03:55:00 >>> host-pkgconf 0.9.12 Building 2023-06-07T03:55:01 >>> host-pkgconf 0.9.12 Installing to host directory 2023-06-07T03:55:02 >>> host-libxml2 2.9.7 Extracting 2023-06-07T03:55:02 >>> host-libxml2 2.9.7 Patching 2023-06-07T03:55:02 >>> host-libxml2 2.9.7 Updating config.sub and config.guess 2023-06-07T03:55:02 >>> host-libxml2 2.9.7 Patching libtool 2023-06-07T03:55:02 >>> host-libxml2 2.9.7 Configuring 2023-06-07T03:55:06 >>> host-libxml2 2.9.7 Building 2023-06-07T03:55:22 >>> host-libxml2 2.9.7 Installing to host directory 2023-06-07T03:55:24 >>> host-gettext 0.19.8.1 Extracting 2023-06-07T03:55:25 >>> host-gettext 0.19.8.1 Patching 2023-06-07T03:55:26 >>> host-gettext 0.19.8.1 Updating config.sub and config.guess 2023-06-07T03:55:26 >>> host-gettext 0.19.8.1 Configuring 2023-06-07T03:55:26 >>> host-gettext 0.19.8.1 Autoreconfiguring 2023-06-07T03:55:51 >>> host-gettext 0.19.8.1 Patching libtool 2023-06-07T03:56:13 >>> host-gettext 0.19.8.1 Building什么问题

时间: 2023-08-07 08:12:25 浏览: 47
这并不是一个问题,而是一段命令行输出。这段输出是在进行一个名为"rk3399_linux_release_v2.5.1_20210301"的项目构建过程中产生的。其中包括了使用不同的工具和库进行编译、安装等操作,如host-gcc-initial、host-libtool、host-autoconf、host-automake、host-pkgconf、host-libxml2、host-gettext等。这些命令的具体含义需要结合项目的具体情况来分析。
相关问题

/home/clzdh/Desktop/rk3399_linux_release_v2.5.1_20210301/buildroot/output/rockchip_rk3399/.rockchipconfig:339:warning: override: reassigning to symbol BR2_PACKAGE_NTFS_3G # # configuration written to /home/clzdh/Desktop/rk3399_linux_release_v2.5.1_20210301/buildroot/output/rockchip_rk3399/.config # make: Leaving directory '/home/clzdh/Desktop/rk3399_linux_release_v2.5.1_20210301/buildroot' you need to install 'unbuffer' (from package expect or expect-dev) log saved on /home/clzdh/Desktop/rk3399_linux_release_v2.5.1_20210301/br.log tail: cannot open '/home/clzdh/Desktop/rk3399_linux_release_v2.5.1_20210301/br.log' for reading: No such file or directory Command exited with non-zero status 1 you take 0:04.44 to build builroot ====Build buildroot failed!====

根据你提供的输出,这是在构建 Buildroot 时遇到的一些警告和错误。 首先,警告显示 `/home/clzdh/Desktop/rk3399_linux_release_v2.5.1_20210301/buildroot/output/rockchip_rk3399/.rockchipconfig` 文件中的第 339 行出现了一个警告,指示重新分配了符号 `BR2_PACKAGE_NTFS_3G`。这可能意味着在配置文件中对该符号进行了重复赋值。 然后,输出显示配置已写入 `/home/clzdh/Desktop/rk3399_linux_release_v2.5.1_20210301/buildroot/output/rockchip_rk3399/.config` 文件。 接下来,输出显示离开了 `/home/clzdh/Desktop/rk3399_linux_release_v2.5.1_20210301/buildroot` 目录。 然后,输出显示需要安装 `unbuffer` 工具。它建议你从 `expect` 或 `expect-dev` 包中安装 `unbuffer`。 然后,输出显示日志保存在 `/home/clzdh/Desktop/rk3399_linux_release_v2.5.1_20210301/br.log` 文件中。 最后,输出显示尝试读取 `/home/clzdh/Desktop/rk3399_linux_release_v2.5.1_20210301/br.log` 文件时出现错误,表示该文件不存在。 根据上述警告和错误,你可以尝试做以下几件事情: 1. 检查配置文件中是否对 `BR2_PACKAGE_NTFS_3G` 进行了重复赋值。打开 `/home/clzdh/Desktop/rk3399_linux_release_v2.5.1_20210301/buildroot/output/rockchip_rk3399/.rockchipconfig` 文件,并检查第 339 行的设置。 2. 检查是否已经安装了 `expect` 或 `expect-dev` 包。你可以使用合适的软件包管理器来安装它们。例如,在 Ubuntu 或基于 Debian 的系统上,你可以使用以下命令: ``` sudo apt-get install expect ``` 3. 检查构建日志是否存在。确认 `/home/clzdh/Desktop/rk3399_linux_release_v2.5.1_20210301/br.log` 文件是否存在,如果不存在,可能是由于构建过程中出现问题导致的。 如果问题仍然存在,请提供更多的上下文或详细描述你的构建环境和步骤,以便我们能够更好地帮助你解决问题。

processing option: roc-rk3399-pc-plus-ubuntu.mk switching to board: /home/clzdh/Desktop/rk3399_linux_release_v2.5.1_20210301/device/rockchip/rk3399/roc-rk3399-pc-plus-ubuntu.mk

根据你提供的信息,这似乎是一个在Ubuntu上构建Rockchip RK3399开发板(roc-rk3399-pc-plus)的过程。该过程可能涉及使用一个名为"roc-rk3399-pc-plus-ubuntu.mk"的选项文件,并将构建环境切换到该选项文件指定的板级配置(board configuration)。 根据文件路径可见,这个选项文件位于"/home/clzdh/Desktop/rk3399_linux_release_v2.5.1_20210301/device/rockchip/rk3399/"目录下。这个选项文件可能包含一些特定于该开发板的配置,用于构建适用于该开发板的Linux系统。 请注意,这只是初步分析,具体的构建过程和配置可能因具体的项目、环境和需求而有所不同。如有需要,你可以进一步查看选项文件的内容以了解更多详细信息。

相关推荐

"C:\Program Files\Java\jdk-1.8\bin\java.exe" -Dmaven.multiModuleProjectDirectory=F:\workmode\h5xjxj\ech-log-server\ech-log-api -Djansi.passthrough=true -Dmaven.home=F:\dev_software\apache-maven-3.6.3 -Dclassworlds.conf=F:\dev_software\apache-maven-3.6.3\bin\m2.conf "-Dmaven.ext.class.path=F:\idea2023\IntelliJ IDEA 2023.1.2\plugins\maven\lib\maven-event-listener.jar" "-javaagent:F:\idea2023\IntelliJ IDEA 2023.1.2\lib\idea_rt.jar=53993:F:\idea2023\IntelliJ IDEA 2023.1.2\bin" -Dfile.encoding=UTF-8 -classpath F:\dev_software\apache-maven-3.6.3\boot\plexus-classworlds-2.6.0.jar;F:\dev_software\apache-maven-3.6.3\boot\plexus-classworlds.license org.codehaus.classworlds.Launcher -Didea.version=2023.1.2 -s C:\Users\田文成\.m2\settings_XJ_git.xml -Dmaven.repo.local=F:\dev_software\repository\localRepository\localRepository install [INFO] Scanning for projects... [INFO] [INFO] -----------------------< com.ai.ecs:ech-log-api >----------------------- [INFO] Building ech-log-api 0.0.1-SNAPSHOT [INFO] --------------------------------[ jar ]--------------------------------- Downloading from nexus1: http://mgr.devstone.cn:18080/nexus/content/groups/public/org/apache/maven/plugins/maven-compiler-plugin/2.5.1/maven-compiler-plugin-2.5.1.pom [INFO] ------------------------------------------------------------------------ [INFO] BUILD FAILURE [INFO] ------------------------------------------------------------------------ [INFO] Total time: 22.280 s [INFO] Finished at: 2023-07-12T16:30:43+08:00 [INFO] ------------------------------------------------------------------------ [ERROR] Plugin org.apache.maven.plugins:maven-compiler-plugin:2.5.1 or one of its dependencies could not be resolved: Failed to read artifact descriptor for org.apache.maven.plugins:maven-compiler-plugin:jar:2.5.1: Could not transfer artifact org.apache.maven.plugins:maven-compiler-plugin:pom:2.5.1 from/to nexus1 (http://mgr.devstone.cn:18080/nexus/content/groups/public): Transfer failed for http://mgr.devstone.cn:18080/nexus/content/groups/public/org/apache/maven/plugins/maven-compiler-plugin/2.5.1/maven-compiler-plugin-2.5.1.pom: Connect to mgr.devstone.cn:18080 [mgr.devstone.cn/218.94.91.233] failed: Connection timed out: connect -> [Help 1] [ERROR] [ERROR] To see the full stack trace of the errors, re-run Maven with the -e switch. [ERROR] Re-run Maven using the -X switch to enable full debug logging. [ERROR] [ERROR] For more information about the errors and possible solutions, please read the following articles: [ERROR] [Help 1] http://cwiki.apache.org/confluence/display/MAVEN/PluginResolutionException 刚导入项目依赖报错

最新推荐

SAP R/3 事务码速查手册SAP R/3 事务码速查手册

2.5.1 FI-AR-CR 信贷管理 55 2.6 FI-AA-AA 基本功能 55 2.6.1 FI-AA-AA-TR-TP 转帐记帐 63 2.6.2 FI-AA-SVA-HI 通货膨胀处理 63 2.6.3 FI-AA-IS 信息系统 63 2.7 FI-SL-SL 基本功能 64 2.7.1 FI-SL-COB 代码块 68 ...

NOKIA_手机软件测试 测试用例

2.4.1 Release Test 12 2.4.2 System Test 12 2.4.3 Focus Test 13 2.4.4 Stress Test 13 2.4.5 Free Test 14 2.5 测试相关文档说明 14 2.5.1 测试计划 14 2.5.2 测试用例 14 2.5.3 错误报告 15 2.5.4 进度报告 16 ...

嵌入式SQL(E-SQL)简介

2.5.1 TELECOM程序 27 2.5.2 ADHOC程序 29 第三节 IBM DB2嵌入SQL语言 35 3.1 一个简单示例 35 3.2 嵌入SQL语句 37 3.2.1宿主变量 37 3.2.2单行查询 39 3.2.3多行查询 39 3.2.4插入、删除和修改操作 40 3.2.5 SQLCA ...

MRP与ERP确定订货批量的方法.pptx

MRP与ERP确定订货批量的方法.pptx

管理建模和仿真的文件

管理Boualem Benatallah引用此版本:布阿利姆·贝纳塔拉。管理建模和仿真。约瑟夫-傅立叶大学-格勒诺布尔第一大学,1996年。法语。NNT:电话:00345357HAL ID:电话:00345357https://theses.hal.science/tel-003453572008年12月9日提交HAL是一个多学科的开放存取档案馆,用于存放和传播科学研究论文,无论它们是否被公开。论文可以来自法国或国外的教学和研究机构,也可以来自公共或私人研究中心。L’archive ouverte pluridisciplinaire

数据可视化在统计分析中的重要性

# 1. 数据可视化的概念与意义 在数据科学和统计分析领域,数据可视化作为一种强大的工具,扮演着至关重要的角色。本章将介绍数据可视化的概念与意义,探讨数据可视化与统计分析的关系,以及数据可视化的作用与优势。 #### 1.1 数据可视化的定义 数据可视化是指利用图形、图表、地图等视觉元素来直观呈现数据信息的过程。它通过视觉化的方式展示数据,帮助人们更直观地理解数据的含义和规律。数据可视化的目的在于让人们能够快速、清晰地认识数据,发现数据中的模式和规律,同时也能够帮助人们传达和交流数据所包含的信息。 #### 1.2 数据可视化的作用与优势 数据可视化的作用包括但不限于: - 使复杂数据变

coxph模型的summary函数以后得到的是什么,分别分析一下

coxph模型是用来拟合生存分析数据的模型,它可以用来评估某些预测变量对于生存时间的影响。在R语言中,当我们用coxph函数拟合模型后,可以使用summary函数来查看模型的摘要信息。 使用summary函数得到的是一个类似于表格的输出结果,其中包含了以下信息: 1. Model:显示了使用的模型类型,这里是Cox Proportional Hazards Model。 2. Call:显示了生成模型的函数及其参数。 3. n:数据集中观测值的数量。 4. Events:数据集中事件(即生存时间结束)的数量。 5. Log-likelihood:给定模型下的对数似然值。 6. C

oracle教程07plsql高级01.pptx

oracle教程07plsql高级01.pptx

"互动学习:行动中的多样性与论文攻读经历"

多样性她- 事实上SCI NCES你的时间表ECOLEDO C Tora SC和NCESPOUR l’Ingén学习互动,互动学习以行动为中心的强化学习学会互动,互动学习,以行动为中心的强化学习计算机科学博士论文于2021年9月28日在Villeneuve d'Asq公开支持马修·瑟林评审团主席法布里斯·勒菲弗尔阿维尼翁大学教授论文指导奥利维尔·皮耶昆谷歌研究教授:智囊团论文联合主任菲利普·普雷教授,大学。里尔/CRISTAL/因里亚报告员奥利维耶·西格德索邦大学报告员卢多维奇·德诺耶教授,Facebook /索邦大学审查员越南圣迈IMT Atlantic高级讲师邀请弗洛里安·斯特鲁布博士,Deepmind对于那些及时看到自己错误的人...3谢谢你首先,我要感谢我的两位博士生导师Olivier和Philippe。奥利维尔,"站在巨人的肩膀上"这句话对你来说完全有意义了。从科学上讲,你知道在这篇论文的(许多)错误中,你是我可以依

时间序列分析的基本概念与应用

# 1. 时间序列分析简介 ## 1.1 什么是时间序列分析? 时间序列分析是一种研究时间序列数据的方法,通过对时间序列数据的观测、建模、预测等过程,揭示其中的规律性和趋势性,帮助我们更好地理解数据背后的信息和规律。 ## 1.2 时间序列分析的重要性 时间序列分析在很多领域具有重要的应用价值,比如经济学、金融学、气象学等。通过分析时间序列数据,我们可以进行未来趋势的预测、异常情况的检测、周期性的分析等,为决策提供数据支持。 ## 1.3 时间序列数据的特点 时间序列数据是按照时间顺序排列的一系列数据点的集合,具有一些特点: - 具有趋势性:数据随时间变化呈现出明显的趋势 - 具有周期性